{"text_format":"2","workbook":"xlsx","n_sheets":7,"sheets":["CPI 2015","Americas","Asia Pacific","MENA","Sub-Saharan Africa","EU+Western Europe","Eastern Europe+Central Asia"],"not_rendered":{"charts":0,"images":0,"macros":0,"external_links":1,"defined_names":0,"comments":0,"pivot_tables":0},"unopened":[],"bounds":{"document_bytes":16777216,"sheet_cells":100000,"run_cost":"one","rows_first":2000,"rows_last":500,"rows_between":2000,"halvings":0,"cell_chars":16384,"cell_head_chars":4096},"cells_cut":0,"cells_raw":0,"read":"whole","date_system":"1900"}

{"sheet":"CPI 2015","index":0,"n_rows":169,"n_cols":23,"rows_kept":169,"cut":false,"hidden":false,"merged":[]}
["Country Rank","Country/Territory","Country Code","Region","CPI 2015 Score","Number of Surveys Used","Std Error","Min","Max","90% Lower CI","90%Upper CI","World Bank CPIA","World  Economic Forum EOS","Bertelsmann  Foundation TI","Arican Development Bank","IMD World Competitiveness Year Book","Bertelsmann Foundation SGI","World Justice Project ROL","PRS Internationl Country Risk Guide","Economist Intelligence Unit","IHS Global Insight","PERC Asia Risk Guide","Freedom House NIT"]
[1,"Denmark","DNK",{"$f":"VLOOKUP(C2, [1]!Table1[[wbcode]:[Region]], 2, FALSE)","v":{"$error":"#REF!"}},91,7,2.1600000858306885,83,98,87,95,null,89,null,null,96,97,88,98,88,83]
[1,"New Zealand","NZL",{"$f":"VLOOKUP(C3, [1]!Table1[[wbcode]:[Region]], 2, FALSE)","v":{"$error":"#REF!"}},91,7,2.3199999332427979,83,98,87,95,null,92,null,null,93,97,83,98,88,83]
[3,"Finland","FIN",{"$f":"VLOOKUP(C4, [1]!Table1[[wbcode]:[Region]], 2, FALSE)","v":{"$error":"#REF!"}},90,7,1.7699999809265137,83,98,87,93,null,93,null,null,91,89,88,98,88,83]
[4,"Sweden","SWE",{"$f":"VLOOKUP(C5, [1]!Table1[[wbcode]:[Region]], 2, FALSE)","v":{"$error":"#REF!"}},89,7,1.7100000381469727,83,98,86,92,null,89,null,null,87,89,88,98,88,83]
[5,"Norway","NOR",{"$f":"VLOOKUP(C6, [1]!Table1[[wbcode]:[Region]], 2, FALSE)","v":{"$error":"#REF!"}},88,7,2.2400000095367432,81,98,84,92,null,92,null,null,84,81,90,98,88,83]
[6,"Switzerland","CHE",{"$f":"VLOOKUP(C7, [1]!Table1[[wbcode]:[Region]], 2, FALSE)","v":{"$error":"#REF!"}},86,6,2.5499999523162842,73,89,82,90,null,87,null,null,88,89,null,89,88,73]
[7,"Luxembourg","LUX",{"$f":"VLOOKUP(C8, [1]!Table1[[wbcode]:[Region]], 2, FALSE)","v":{"$error":"#REF!"}},85,5,1.6000000238418579,81,89,82,88,null,89,null,null,85,81,null,89,null,83]
[7,"Singapore","SGP",{"$f":"VLOOKUP(C9, [1]!Table1[[wbcode]:[Region]], 2, FALSE)","v":{"$error":"#REF!"}},85,8,2.0199999809265137,75,92,82,88,null,92,75,null,87,null,90,79,88,83,84]
[9,"Netherlands","NLD",{"$f":"VLOOKUP(C10, [1]!Table1[[wbcode]:[Region]], 2, FALSE)","v":{"$error":"#REF!"}},84,7,1.9800000190734863,73,89,81,87,null,84,null,null,85,73,85,89,88,83]
[10,"Canada","CAN",{"$f":"VLOOKUP(C11, [1]!Table1[[wbcode]:[Region]], 2, FALSE)","v":{"$error":"#REF!"}},83,7,1.6299999952316284,79,89,80,86,null,79,null,null,79,81,79,89,88,83]
[11,"Germany","DEU",{"$f":"VLOOKUP(C12, [1]!Table1[[wbcode]:[Region]], 2, FALSE)","v":{"$error":"#REF!"}},81,7,2.5,72,89,77,85,null,72,null,null,83,81,80,89,88,73]
[11,"United Kingdom","GBR",{"$f":"VLOOKUP(C13, [1]!Table1[[wbcode]:[Region]], 2, FALSE)","v":{"$error":"#REF!"}},81,7,2.4000000953674316,73,89,77,85,null,82,null,null,81,73,80,89,88,73]
[13,"Australia","AUS",{"$f":"VLOOKUP(C14, [1]!Table1[[wbcode]:[Region]], 2, FALSE)","v":{"$error":"#REF!"}},79,8,1.5,71,83,77,81,null,81,null,null,82,81,81,79,71,83,74]
[13,"Iceland","ISL",{"$f":"VLOOKUP(C15, [1]!Table1[[wbcode]:[Region]], 2, FALSE)","v":{"$error":"#REF!"}},79,5,4.5300002098083496,65,89,72,86,null,87,null,null,83,65,null,89,null,73]
[15,"Belgium","BEL",{"$f":"VLOOKUP(C16, [1]!Table1[[wbcode]:[Region]], 2, FALSE)","v":{"$error":"#REF!"}},77,7,1.3400000333786011,71,81,75,79,null,79,null,null,77,81,76,79,71,73]
[16,"Austria","AUT",{"$f":"VLOOKUP(C17, [1]!Table1[[wbcode]:[Region]], 2, FALSE)","v":{"$error":"#REF!"}},76,7,1.7599999904632568,70,81,73,79,null,77,null,null,70,81,81,79,71,73]
[16,"United States","USA",{"$f":"VLOOKUP(C18, [1]!Table1[[wbcode]:[Region]], 2, FALSE)","v":{"$error":"#REF!"}},76,8,3.4700000286102295,59,89,70,82,null,69,null,null,74,89,74,79,88,73,59]
[18,"Hong Kong","HKG",{"$f":"VLOOKUP(C19, [1]!Table1[[wbcode]:[Region]], 2, FALSE)","v":{"$error":"#REF!"}},75,7,2.4800000190734863,69,87,71,79,null,87,null,null,80,null,78,69,71,73,70]
[18,"Ireland","IRL",{"$f":"VLOOKUP(C20, [1]!Table1[[wbcode]:[Region]], 2, FALSE)","v":{"$error":"#REF!"}},75,6,4.9200000762939453,54,89,67,83,null,89,null,null,83,73,null,79,54,73]
[18,"Japan","JPN",{"$f":"VLOOKUP(C21, [1]!Table1[[wbcode]:[Region]], 2, FALSE)","v":{"$error":"#REF!"}},75,8,2.9600000381469727,57,84,70,80,null,84,null,null,76,57,76,79,71,73,82]
[21,"Uruguay","URY",{"$f":"VLOOKUP(C22, [1]!Table1[[wbcode]:[Region]], 2, FALSE)","v":{"$error":"#REF!"}},74,6,1.6799999475479126,70,79,71,77,null,71,79,null,null,null,70,79,71,73]
[22,"Qatar","QAT",{"$f":"VLOOKUP(C23, [1]!Table1[[wbcode]:[Region]], 2, FALSE)","v":{"$error":"#REF!"}},71,6,6.630000114440918,40,83,60,82,null,83,40,null,79,null,null,69,71,83]
[23,"Chile","CHL",{"$f":"VLOOKUP(C24, [1]!Table1[[wbcode]:[Region]], 2, FALSE)","v":{"$error":"#REF!"}},70,8,2.1500000953674316,60,79,66,74,null,66,75,null,60,65,68,79,71,73]
[23,"Estonia","EST",{"$f":"VLOOKUP(C25, [1]!Table1[[wbcode]:[Region]], 2, FALSE)","v":{"$error":"#REF!"}},70,9,2.7899999618530273,54,81,65,75,null,79,75,null,73,81,71,69,54,63,null,66]
[23,"France","FRA",{"$f":"VLOOKUP(C26, [1]!Table1[[wbcode]:[Region]], 2, FALSE)","v":{"$error":"#REF!"}},70,7,2.4900000095367432,57,79,66,74,null,70,null,null,71,57,71,79,71,73]
[23,"United Arab Emirates","ARE",{"$f":"VLOOKUP(C27, [1]!Table1[[wbcode]:[Region]], 2, FALSE)","v":{"$error":"#REF!"}},70,7,5.070000171661377,53,91,62,78,null,91,53,null,76,null,77,69,54,73]
[27,"Bhutan","BTN",{"$f":"VLOOKUP(C28, [1]!Table1[[wbcode]:[Region]], 2, FALSE)","v":{"$error":"#REF!"}},65,4,2.1400001049041748,60,70,61,69,70,60,66,{"$nulls":6},63]
[28,"Portugal","PRT",{"$f":"VLOOKUP(C29, [1]!Table1[[wbcode]:[Region]], 2, FALSE)","v":{"$error":"#REF!"}},64,7,2.5,54,73,60,68,null,62,null,null,58,65,68,69,54,73]
[29,"Botswana","BWA",{"$f":"VLOOKUP(C30, [1]!Table1[[wbcode]:[Region]], 2, FALSE)","v":{"$error":"#REF!"}},63,6,2.3499999046325684,58,71,59,67,null,59,58,null,null,null,58,69,71,63]
{"$rows_left_out":140}
{"sheet":"Americas","index":1,"n_rows":27,"n_cols":23,"rows_kept":27,"cut":false,"hidden":false,"merged":[]}
["Country Rank","Regional Rank","Country/Territory","Country Code","CPI 2015 Score","Number of Surveys Used","Std Error","Min","Max","90% Lower CI","90%Upper CI","World Bank CPIA","World  Economic Forum EOS","Bertelsmann  Foundation TI","Arican Development Bank","IMD World Competitiveness Year Book","Bertelsmann Foundation SGI","World Justice Project ROL","PRS Internationl Country Risk Guide","Economist Intelligence Unit","IHS Global Insight","PERC Asia Risk Guide","Freedom House NIT"]
[10,1,"Canada","CAN",83,7,1.6299999952316284,79,89,80,86,null,79,null,null,79,81,79,89,88,83]
[16,2,"United States","USA",76,8,3.4700000286102295,59,89,70,82,null,69,null,null,74,89,74,79,88,73,59]
[21,3,"Uruguay","URY",74,6,1.6799999475479126,70,79,71,77,null,71,79,null,null,null,70,79,71,73]
[23,4,"Chile","CHL",70,8,2.1500000953674316,60,79,66,74,null,66,75,null,60,65,68,79,71,73]
[40,5,"Costa Rica","CRI",55,6,2.7100000381469727,48,66,51,59,null,48,66,null,null,null,59,50,54,52]
[56,6,"Cuba","CUB",47,4,3.6400001049041748,40,54,41,53,null,null,40,{"$nulls":4},41,54,52]
[69,7,"Jamaica","JAM",41,6,1.6799999475479126,36,48,38,44,null,42,36,null,null,null,48,41,38,42]
[72,8,"El Salvador","SLV",39,6,2.2599999904632568,29,45,35,43,null,37,45,null,null,null,29,41,38,42]
[72,8,"Panama","PAN",39,6,3.0099999904632568,31,52,34,44,null,41,36,null,null,null,34,31,38,52]
[72,8,"Trinidad and Tobago","TTO",39,4,4.6399998664855957,31,52,31,47,null,34,{"$nulls":5},31,38,52]
[76,11,"Brazil","BRA",38,7,5.2899999618530273,25,62,29,47,null,25,62,null,25,null,34,31,38,52]
[83,12,"Colombia","COL",37,7,1.940000057220459,31,45,34,40,null,36,45,null,31,null,33,41,38,32]
[88,13,"Peru","PER",36,7,3.0499999523162842,24,45,31,41,null,44,45,null,30,null,24,31,38,42]
[88,13,"Suriname","SUR",36,3,3.2100000381469727,31,42,31,41,null,35,{"$nulls":5},31,null,42]
[98,15,"Bolivia","BOL",34,7,3.5799999237060547,20,47,28,40,47,25,36,null,null,null,20,31,38,42]
[102,16,"Dominican Republic","DOM",33,6,2.630000114440918,24,42,29,37,null,29,32,null,null,null,24,31,38,42]
[106,17,"Argentina","ARG",32,7,1.8400000333786011,25,38,29,35,null,28,36,null,25,null,37,31,38,32]
[106,17,"Ecuador","ECU",32,6,2.8599998950958252,21,43,27,37,null,43,32,null,null,null,30,31,21,32]
[111,19,"Honduras","HND",31,7,4.119999885559082,17,45,24,38,35,45,36,null,null,null,17,41,21,22]
[111,19,"Mexico","MEX",31,8,3.0199999809265137,20,42,26,36,null,33,28,null,28,41,20,21,38,42]
[119,21,"Guyana","GUY",29,4,3.0099999904632568,21,35,24,34,35,29,{"$nulls":5},21,null,32]
[123,22,"Guatemala","GTM",28,6,3.4600000381469727,15,38,22,34,null,38,32,null,null,null,15,31,21,32]
[130,23,"Nicaragua","NIC",27,7,2.5,19,35,23,31,35,33,28,null,null,null,19,21,21,32]
[130,23,"Paraguay","PRY",27,5,2.8499999046325684,21,36,22,32,null,25,36,{"$nulls":4},31,21,22]
[158,25,"Haiti","HTI",17,5,2.7400000095367432,11,24,13,21,23,24,15,{"$nulls":4},12,null,11]
[158,25,"Venezuela","VEN",17,7,2.6400001049041748,5,25,13,21,null,21,15,null,25,null,5,12,21,22]

{"sheet":"Asia Pacific","index":2,"n_rows":28,"n_cols":23,"rows_kept":28,"cut":false,"hidden":false,"merged":[]}
["Country Rank","Regional Rank","Country/Territory","Country Code","CPI 2015 Score","Number of Surveys Used","Std Error","Min","Max","90% Lower CI","90%Upper CI","World Bank CPIA","World  Economic Forum EOS","Bertelsmann  Foundation TI","Arican Development Bank","IMD World Competitiveness Year Book","Bertelsmann Foundation SGI","World Justice Project ROL","PRS Internationl Country Risk Guide","Economist Intelligence Unit","IHS Global Insight","PERC Asia Risk Guide","Freedom House NIT"]
[1,1,"New Zealand","NZL",91,7,2.3199999332427979,83,98,87,95,null,92,null,null,93,97,83,98,88,83]
[7,2,"Singapore","SGP",85,8,2.0199999809265137,75,92,82,88,null,92,75,null,87,null,90,79,88,83,84]
[13,3,"Australia","AUS",79,8,1.5,71,83,77,81,null,81,null,null,82,81,81,79,71,83,74]
[18,4,"Hong Kong","HKG",75,7,2.4800000190734863,69,87,71,79,null,87,null,null,80,null,78,69,71,73,70]
[18,4,"Japan","JPN",75,8,2.9600000381469727,57,84,70,80,null,84,null,null,76,57,76,79,71,73,82]
[27,6,"Bhutan","BTN",65,4,2.1400001049041748,60,70,61,69,70,60,66,{"$nulls":6},63]
[31,7,"Taiwan","TWN",62,7,3.7799999713897705,50,79,56,68,null,70,79,null,60,null,null,50,54,63,56]
[43,8,"Korea (South)","KOR",54,9,2.2899999618530273,46,70,50,58,null,52,58,null,51,57,70,50,54,52,46]
[54,9,"Malaysia","MYS",50,8,3,40,64,45,55,null,64,49,null,53,null,40,41,54,42,56]
[72,10,"Mongolia","MNG",39,8,1.7599999904632568,31,47,36,42,47,42,36,null,37,null,35,31,38,42]
[76,11,"India","IND",38,8,3.1400001049041748,25,54,33,43,null,54,45,null,35,null,25,41,38,32,33]
[76,11,"Thailand","THA",38,8,2.119999885559082,26,43,35,41,null,43,40,null,38,null,26,31,38,42,42]
[83,13,"China","CHN",37,8,2.3399999141693115,28,49,33,41,null,49,36,null,39,null,28,31,38,32,41]
[83,13,"Sri Lanka","LKA",37,7,2.0899999141693115,28,44,34,40,35,44,28,null,null,null,34,41,38,42]
[88,15,"Indonesia","IDN",36,8,3.3900001049041748,17,50,30,42,null,43,36,null,37,null,17,50,38,32,32]
[95,16,"Philippines","PHL",35,8,1.9199999570846558,23,41,32,38,null,36,36,null,33,null,23,41,38,32,37]
[111,17,"Vietnam","VNM",31,8,2.559999942779541,21,41,27,35,35,37,28,null,null,null,36,41,21,22,31]
[117,18,"Pakistan","PAK",30,7,3.119999885559082,19,42,25,35,23,34,19,null,null,null,26,31,38,42]
[123,19,"Timor-Leste","TLS",28,3,5.1700000762939453,22,38,20,36,23,38,{"$nulls":7},22]
[130,20,"Nepal","NPL",27,5,2.7300000190734863,22,35,23,31,35,33,23,null,null,null,24,null,null,22]
[139,21,"Bangladesh","BGD",25,7,4.3000001907348633,16,50,18,32,23,19,23,null,null,null,16,50,21,22]
[139,21,"Laos","LAO",25,4,5.309999942779541,15,40,16,34,23,40,15,{"$nulls":6},22]
[139,21,"Papua New Guinea","PNG",25,5,4.2199997901916504,11,35,18,32,35,null,28,{"$nulls":4},31,21,11]
[147,24,"Myanmar","MMR",22,7,2.8199999332427979,11,35,17,27,35,27,19,null,null,null,19,21,21,11]
[150,25,"Cambodia","KHM",21,7,3.869999885559082,10,35,15,27,12,35,15,null,null,null,10,null,21,22,35]
[166,26,"Afghanistan","AFG",11,4,3.4900000095367432,2,19,5,17,12,null,19,null,null,null,2,null,null,11]
[167,27,"Korea (North)","PRK",8,3,3.380000114440918,1,12,2,14,null,null,10,{"$nulls":4},12,null,1]

{"sheet":"MENA","index":3,"n_rows":20,"n_cols":23,"rows_kept":20,"cut":false,"hidden":false,"merged":[]}
["Country Rank","Regional Rank","Country/Territory","Country Code","CPI 2015 Score","Number of Surveys Used","Std Error","Min","Max","90% Lower CI","90%Upper CI","World Bank CPIA","World  Economic Forum EOS","Bertelsmann  Foundation TI","Arican Development Bank","IMD World Competitiveness Year Book","Bertelsmann Foundation SGI","World Justice Project ROL","PRS Internationl Country Risk Guide","Economist Intelligence Unit","IHS Global Insight","PERC Asia Risk Guide","Freedom House NIT"]
[22,1,"Qatar","QAT",71,6,6.630000114440918,40,83,60,82,null,83,40,null,79,null,null,69,71,83]
[23,2,"United Arab Emirates","ARE",70,7,5.070000171661377,53,91,62,78,null,91,53,null,76,null,77,69,54,73]
[32,3,"Israel","ISR",61,6,2.7799999713897705,52,71,56,66,null,64,null,null,56,65,null,60,71,52]
[45,4,"Jordan","JOR",53,7,3,40,65,48,58,null,60,40,null,65,null,51,50,54,52]
[48,5,"Saudi Arabia","SAU",52,5,7.0300002098083496,36,77,40,64,null,77,36,{"$nulls":4},50,54,42]
[50,6,"Bahrain","BHR",51,5,7.8600001335144043,36,80,38,64,null,80,36,{"$nulls":4},50,38,52]
[55,7,"Kuwait","KWT",49,5,4.5100002288818359,38,63,42,56,null,52,40,{"$nulls":4},50,38,63]
[60,8,"Oman","OMN",45,5,6.690000057220459,23,62,34,56,null,62,23,{"$nulls":4},50,38,52]
[76,9,"Tunisia","TUN",38,6,2.1700000762939453,28,42,34,42,null,42,28,null,null,null,38,41,38,42]
[88,10,"Algeria","DZA",36,5,1.8500000238418579,31,42,33,39,null,34,36,{"$nulls":4},31,38,42]
[88,10,"Egypt","EGY",36,6,2.4700000286102295,31,47,32,40,null,47,32,null,null,null,35,31,38,32]
[88,10,"Morocco","MAR",36,6,3.8499999046325684,22,47,30,42,null,47,28,null,null,null,22,41,38,42]
[123,13,"Lebanon","LBN",28,6,3.2200000286102295,19,38,23,33,null,35,19,null,null,null,24,21,38,32]
[130,14,"Iran","IRN",27,6,3.2799999713897705,21,41,22,32,null,41,23,null,null,null,31,21,21,22]
[154,15,"Syria","SYR",18,4,5.6599998474121094,6,32,9,27,null,null,6,{"$nulls":4},12,21,32]
[154,15,"Yemen","YEM",18,6,2.6600000858306885,12,28,14,22,12,14,28,{"$nulls":4},12,21,22]
[161,17,"Iraq","IRQ",16,4,2.5,11,21,12,20,null,null,19,{"$nulls":4},12,21,11]
[161,17,"Libya","LBY",16,5,3.1800000667572021,10,26,11,21,null,26,10,{"$nulls":4},12,21,11]
[165,19,"Sudan","SDN",12,6,3.6400001049041748,0,21,6,18,0,null,15,20,null,null,null,2,21,11]

{"sheet":"Sub-Saharan Africa","index":4,"n_rows":47,"n_cols":23,"rows_kept":47,"cut":false,"hidden":false,"merged":[]}
["Country Rank","Regional Rank","Country/Territory","Country Code","CPI 2015 Score","Number of Surveys Used","Std Error","Min","Max","90% Lower CI","90%Upper CI","World Bank CPIA","World  Economic Forum EOS","Bertelsmann  Foundation TI","Arican Development Bank","IMD World Competitiveness Year Book","Bertelsmann Foundation SGI","World Justice Project ROL","PRS Internationl Country Risk Guide","Economist Intelligence Unit","IHS Global Insight","PERC Asia Risk Guide","Freedom House NIT"]
[29,1,"Botswana","BWA",63,6,2.3499999046325684,58,71,59,67,null,59,58,null,null,null,58,69,71,63]
[40,2,"Cape Verde","CPV",55,4,6.1599998474121094,42,70,45,65,70,49,null,60,{"$nulls":5},42]
[40,2,"Seychelles","SYC",55,3,8.5,42,71,41,69,null,42,{"$nulls":6},71,52]
[43,4,"Rwanda","RWA",54,5,6.4200000762939453,40,78,43,65,47,78,40,55,{"$nulls":5},52]
[45,5,"Mauritius","MUS",53,4,1.4900000095367432,49,56,51,55,null,56,49,{"$nulls":5},54,52]
[45,5,"Namibia","NAM",53,5,2.75,48,63,48,58,null,48,49,{"$nulls":4},50,54,63]
[56,7,"Ghana","GHA",47,8,2.8199999332427979,33,55,42,52,47,33,45,55,null,null,37,50,54,52]
[61,8,"Lesotho","LSO",44,5,4.9899997711181641,35,63,36,52,35,38,40,42,{"$nulls":5},63]
[61,8,"Senegal","SEN",44,8,2.6099998950958252,32,54,40,48,47,43,53,45,null,null,38,41,54,32]
[61,8,"South Africa","ZAF",44,7,2.6099998950958252,34,54,40,48,null,52,45,null,34,null,41,41,54,42]
[66,11,"Sao Tome and Principe","STP",42,3,5,32,47,34,50,47,null,null,47,{"$nulls":5},32]
[76,12,"Burkina Faso","BFA",38,7,2.9700000286102295,28,47,33,43,47,29,32,45,null,null,28,41,null,42]
[76,12,"Zambia","ZMB",38,8,2.5499999523162842,28,50,34,42,35,46,28,50,null,null,36,41,38,32]
[83,14,"Benin","BEN",37,5,4.429999828338623,25,47,30,44,47,25,32,47,{"$nulls":5},32]
[83,14,"Liberia","LBR",37,7,4.2199997901916504,14,45,30,44,35,44,45,45,null,null,14,41,null,32]
[95,16,"Mali","MLI",35,6,1.8899999856948853,31,42,32,38,35,32,32,40,null,null,null,31,null,42]
[98,17,"Djibouti","DJI",34,3,9.0699996948242188,23,52,19,49,23,null,null,27,{"$nulls":5},52]
[98,17,"Gabon","GAB",34,4,1.6499999761581421,31,38,31,37,null,36,{"$nulls":5},31,38,32]
[98,17,"Niger","NER",34,5,4.1599998474121094,21,47,27,41,35,null,36,47,null,null,null,21,null,32]
[102,20,"Ethiopia","ETH",33,8,2.7300000190734863,22,42,29,37,35,42,23,42,null,null,32,31,38,22]
[106,21,"Côte d´Ivoire","CIV",32,8,2.6500000953674316,22,46,28,36,35,46,28,32,null,null,26,31,38,22]
[106,21,"Togo","TGO",32,5,3.0399999618530273,23,42,27,37,23,null,32,30,null,null,null,31,null,42]
[111,23,"Malawi","MWI",31,8,2.4100000858306885,21,42,27,35,23,32,36,42,null,null,27,31,21,32]
[111,23,"Mauritania","MRT",31,5,5.070000171661377,12,42,23,39,35,12,32,35,{"$nulls":5},42]
[111,23,"Mozambique","MOZ",31,7,1.9700000286102295,22,38,28,34,35,28,28,22,null,null,null,31,38,32]
[117,26,"Tanzania","TZA",30,8,3.4900000095367432,11,42,24,36,35,31,32,42,null,null,21,31,38,11]
[119,27,"Sierra Leone","SLE",29,8,3.440000057220459,14,40,23,35,35,20,40,40,null,null,14,31,21,32]
[123,28,"Gambia","GMB",28,5,6.6700000762939453,12,49,17,39,12,49,null,15,null,null,null,31,null,32]
[123,28,"Madagascar","MDG",28,7,2.9900000095367432,20,42,23,33,23,29,32,20,null,null,20,31,null,42]
{"$rows_left_out":18}
{"sheet":"EU+Western Europe","index":5,"n_rows":32,"n_cols":23,"rows_kept":32,"cut":false,"hidden":false,"merged":[]}
["Country Rank","Regional Rank","Country/Territory","Country Code","CPI 2015 Score","Number of Surveys Used","Std Error","Min","Max","90% Lower CI","90%Upper CI","World Bank CPIA","World  Economic Forum EOS","Bertelsmann  Foundation TI","Arican Development Bank","IMD World Competitiveness Year Book","Bertelsmann Foundation SGI","World Justice Project ROL","PRS Internationl Country Risk Guide","Economist Intelligence Unit","IHS Global Insight","PERC Asia Risk Guide","Freedom House NIT"]
[1,1,"Denmark","DNK",91,7,2.1600000858306885,83,98,87,95,null,89,null,null,96,97,88,98,88,83]
[3,2,"Finland","FIN",90,7,1.7699999809265137,83,98,87,93,null,93,null,null,91,89,88,98,88,83]
[4,3,"Sweden","SWE",89,7,1.7100000381469727,83,98,86,92,null,89,null,null,87,89,88,98,88,83]
[5,4,"Norway","NOR",88,7,2.2400000095367432,81,98,84,92,null,92,null,null,84,81,90,98,88,83]
[6,5,"Switzerland","CHE",86,6,2.5499999523162842,73,89,82,90,null,87,null,null,88,89,null,89,88,73]
[7,6,"Luxembourg","LUX",85,5,1.6000000238418579,81,89,82,88,null,89,null,null,85,81,null,89,null,83]
[9,7,"Netherlands","NLD",84,7,1.9800000190734863,73,89,81,87,null,84,null,null,85,73,85,89,88,83]
[11,8,"Germany","DEU",81,7,2.5,72,89,77,85,null,72,null,null,83,81,80,89,88,73]
[11,8,"United Kingdom","GBR",81,7,2.4000000953674316,73,89,77,85,null,82,null,null,81,73,80,89,88,73]
[13,10,"Iceland","ISL",79,5,4.5300002098083496,65,89,72,86,null,87,null,null,83,65,null,89,null,73]
[15,11,"Belgium","BEL",77,7,1.3400000333786011,71,81,75,79,null,79,null,null,77,81,76,79,71,73]
[16,12,"Austria","AUT",76,7,1.7599999904632568,70,81,73,79,null,77,null,null,70,81,81,79,71,73]
[18,13,"Ireland","IRL",75,6,4.9200000762939453,54,89,67,83,null,89,null,null,83,73,null,79,54,73]
[23,14,"Estonia","EST",70,9,2.7899999618530273,54,81,65,75,null,79,75,null,73,81,71,69,54,63,null,66]
[23,14,"France","FRA",70,7,2.4900000095367432,57,79,66,74,null,70,null,null,71,57,71,79,71,73]
[28,16,"Portugal","PRT",64,7,2.5,54,73,60,68,null,62,null,null,58,65,68,69,54,73]
[29,17,"Poland","POL",63,9,2.5899999141693115,54,73,59,67,null,58,71,null,58,73,67,60,54,73,null,55]
[32,18,"Cyprus","CYP",61,5,4.1700000762939453,49,71,54,68,null,55,null,null,null,49,null,69,71,63]
[34,19,"Malta","MLT",60,4,1.3200000524520874,57,63,58,62,null,58,null,null,null,57,null,60,null,63]
[34,19,"Slovenia","SVN",60,9,2.9300000667572021,42,73,55,65,null,62,66,null,42,57,58,60,54,73,null,66]
[36,21,"Lithuania","LTU",59,8,1.9199999570846558,51,66,56,62,null,60,66,null,51,65,null,60,54,63,null,55]
[37,22,"Spain","ESP",58,7,4.070000171661377,37,71,51,65,null,55,null,null,37,57,65,60,71,63]
[38,23,"Czech Republic","CZE",56,9,2.2100000381469727,44,66,52,60,null,53,66,null,44,57,59,50,54,63,null,55]
[38,23,"Latvia","LVA",56,8,2.7599999904632568,48,73,51,61,null,56,58,null,48,73,null,50,54,52,null,60]
[50,25,"Croatia","HRV",51,9,2.0199999809265137,41,62,48,54,null,46,62,null,41,57,50,50,54,52,null,50]
[50,25,"Hungary","HUN",51,9,3.7300000190734863,34,71,45,57,null,47,53,null,34,41,44,50,71,63,null,52]
[50,25,"Slovakia","SVK",51,8,3.630000114440918,35,63,45,57,null,38,62,null,35,57,null,50,54,63,null,52]
[58,28,"Greece","GRC",46,7,5.0799999237060547,21,63,38,54,null,45,null,null,43,57,50,41,21,63]
[58,28,"Romania","ROM",46,9,3.1099998950958252,36,62,41,51,null,36,62,null,37,57,45,41,38,42,null,52]
{"$rows_left_out":3}
{"sheet":"Eastern Europe+Central Asia","index":6,"n_rows":20,"n_cols":23,"rows_kept":20,"cut":false,"hidden":false,"merged":[]}
["Country Rank","Regional Rank","Country/Territory","Country Code","CPI 2015 Score","Number of Surveys Used","Std Error","Min","Max","90% Lower CI","90%Upper CI","World Bank CPIA","World  Economic Forum EOS","Bertelsmann  Foundation TI","Arican Development Bank","IMD World Competitiveness Year Book","Bertelsmann Foundation SGI","World Justice Project ROL","PRS Internationl Country Risk Guide","Economist Intelligence Unit","IHS Global Insight","PERC Asia Risk Guide","Freedom House NIT"]
[48,1,"Georgia","GEO",52,5,6.5300002098083496,32,69,41,63,null,69,53,null,null,null,62,null,null,32,null,44]
[61,2,"Montenegro","MON",44,4,4.869999885559082,32,53,36,52,null,50,53,{"$nulls":6},32,null,39]
[66,3,"The FYR of Macedonia","MKD",42,6,5.2699999809265137,21,61,33,51,null,61,40,null,null,null,41,null,21,42,null,47]
[66,3,"Turkey","TUR",42,8,2.0199999809265137,33,53,39,45,null,53,45,null,42,41,33,41,38,42]
[71,5,"Serbia","SCG",40,7,3.9000000953674316,27,58,34,46,null,37,58,null,null,null,27,31,38,42,null,47]
[76,6,"Bosnia and Herzegovina","BIH",38,6,1.7100000381469727,32,42,35,41,null,32,40,null,null,null,34,null,38,42,null,42]
[88,7,"Albania","ALB",36,7,3.5799999237060547,18,49,30,42,null,49,36,null,null,null,18,41,38,32,null,37]
[95,8,"Armenia","ARM",35,5,2.9800000190734863,28,45,30,40,null,45,28,{"$nulls":4},31,null,32,null,37]
[102,9,"Kosovo","LWI",33,3,2.190000057220459,29,36,29,37,35,null,36,{"$nulls":8},29]
[102,9,"Moldova","MDA",33,8,2.880000114440918,16,42,28,38,35,30,40,null,null,null,16,31,38,42,null,31]
[106,11,"Belarus","BLR",32,6,4.369999885559082,21,52,25,39,null,null,28,null,null,null,52,31,21,32,null,26]
[119,12,"Azerbaijan","AZE",29,6,3.25,21,38,24,34,null,37,23,{"$nulls":4},21,38,32,null,21]
[119,12,"Russia","RUS",29,8,2.5199999809265137,21,38,25,33,null,38,28,null,33,null,28,21,38,22,null,21]
[123,14,"Kazakhstan","KAZ",28,8,4.9000000953674316,11,51,20,36,null,51,19,null,46,null,28,21,21,11,null,23]
[123,14,"Kyrgyzstan","KGZ",28,6,2.2899999618530273,20,35,24,32,35,25,32,null,null,null,20,null,null,32,null,26]
[130,16,"Ukraine","UKR",27,8,1.9299999475479126,21,36,24,30,null,28,36,null,26,null,22,21,21,32,null,29]
[136,17,"Tajikistan","TJK",26,5,7.3600001335144043,11,53,14,38,23,53,15,{"$nulls":6},11,null,26]
[153,18,"Uzbekistan","UZB",19,6,2.7100000381469727,11,29,15,23,12,null,19,null,null,null,29,null,21,11,null,21]
[154,19,"Turkmenistan","TKM",18,4,2.380000114440918,11,21,14,22,null,null,19,{"$nulls":5},21,11,null,21]